summaryrefslogtreecommitdiffstats
path: root/tests/m2sci_tests/generated_files/valid_ref_logs/ATAN_valid.log
blob: f90b287019b1a6e77b2082cea66cb2a227befe7f (plain)
1
2
3
4
5
6
7
8
9
10
11
12
13
14
15
16
17
18
19
20
21
22
23
24
25
26
27
28
29
30
31
32
33
34
35
36
37
38
39
40
41
42
43
44
45
46
47
48
49
50
51
52
53
54
55
56
57
58
59
60
61
62
63
64
65
66
67
68
69
70
71
72
73
74
75
76
77
78
79
80
81
*** TEST 1 PASSED ***

*** TEST 2 PASSED ***

*** TEST 3 PASSED ***

*** TEST 4 PASSED ***

*** TEST 5 PASSED ***

*** TEST 6 PASSED ***

*** TEST 7 PASSED ***

*** TEST 8 PASSED ***

*** TEST 9 PASSED ***

*** TEST 10 PASSED ***

*** TEST 11 PASSED ***

*** TEST 12 PASSED ***

*** TEST 13 PASSED ***

*** TEST 14 PASSED ***

*** TEST 15 PASSED ***

*** TEST 16 PASSED ***

TEST 17: Scilab and Matlab values do not match for res17
Scilab value: [%nan+%i*%inf,1.5707963267949+%i*0.5493061443341,1.5707963267949+%i*0.34657359028]
Matlab value: [%nan+%i*%inf,-1.5707963267949+%i*0.5493061443341,-1.5707963267949+%i*0.34657359028]
*** TEST 17 FAILED ***

TEST 18: Scilab and Matlab values do not match for res18
Scilab value: [%nan+%i*%inf;1.5707963267949+%i*0.5493061443341;1.5707963267949+%i*0.34657359028]
Matlab value: [%nan+%i*%inf;-1.5707963267949+%i*0.5493061443341;-1.5707963267949+%i*0.34657359028]
*** TEST 18 FAILED ***

TEST 19: Scilab and Matlab values do not match for res19
Scilab value: [%nan+%i*%inf,1.5707963267949+%i*0.5493061443341,1.5707963267949+%i*0.34657359028;1.5707963267949+%i*0.255412811883,1.5707963267949+%i*0.2027325540541, 1.5707963267949+%i*0.1682361183106]
Matlab value: [%nan+%i*%inf,-1.5707963267949+%i*0.5493061443341,-1.5707963267949+%i*0.34657359028;-1.5707963267949+%i*0.255412811883,-1.5707963267949+%i*0.2027325540541, -1.5707963267949+%i*0.1682361183106]
*** TEST 19 FAILED ***

*** TEST 20 FAILED ***

TEST 21: Scilab and Matlab values do not match for res21
Scilab value: [%nan+%i*%inf,1.5707963267949+%i*0.5493061443341,1.5707963267949+%i*0.34657359028]
Matlab value: [%nan+%i*%inf,-1.5707963267949+%i*0.5493061443341,-1.5707963267949+%i*0.34657359028]
*** TEST 21 FAILED ***

TEST 22: Scilab and Matlab values do not match for res22
Scilab value: [%nan+%i*%inf;1.5707963267949+%i*0.5493061443341;1.5707963267949+%i*0.34657359028]
Matlab value: [%nan+%i*%inf;-1.5707963267949+%i*0.5493061443341;-1.5707963267949+%i*0.34657359028]
*** TEST 22 FAILED ***

TEST 23: Scilab and Matlab values do not match for res23
Scilab value: [%nan+%i*%inf,1.5707963267949+%i*0.5493061443341,1.5707963267949+%i*0.34657359028;1.5707963267949+%i*0.255412811883,1.5707963267949+%i*0.2027325540541, 1.5707963267949+%i*0.1682361183106]
Matlab value: [%nan+%i*%inf,-1.5707963267949+%i*0.5493061443341,-1.5707963267949+%i*0.34657359028;-1.5707963267949+%i*0.255412811883,-1.5707963267949+%i*0.2027325540541, -1.5707963267949+%i*0.1682361183106]
*** TEST 23 FAILED ***

*** TEST 24 FAILED ***

TEST 25: Scilab and Matlab values do not match for res25
Scilab value: [%nan+%i*%inf,1.5707963267949+%i*0.5493061443341,1.5707963267949+%i*0.34657359028]
Matlab value: [%nan+%i*%inf,-1.5707963267949+%i*0.5493061443341,-1.5707963267949+%i*0.34657359028]
*** TEST 25 FAILED ***

TEST 26: Scilab and Matlab values do not match for res26
Scilab value: [%nan+%i*%inf;1.5707963267949+%i*0.5493061443341;1.5707963267949+%i*0.34657359028]
Matlab value: [%nan+%i*%inf;-1.5707963267949+%i*0.5493061443341;-1.5707963267949+%i*0.34657359028]
*** TEST 26 FAILED ***

TEST 27: Scilab and Matlab values do not match for res27
Scilab value: [%nan+%i*%inf,1.5707963267949+%i*0.5493061443341,1.5707963267949+%i*0.34657359028;1.5707963267949+%i*0.255412811883,1.5707963267949+%i*0.2027325540541, 1.5707963267949+%i*0.1682361183106]
Matlab value: [%nan+%i*%inf,-1.5707963267949+%i*0.5493061443341,-1.5707963267949+%i*0.34657359028;-1.5707963267949+%i*0.255412811883,-1.5707963267949+%i*0.2027325540541, -1.5707963267949+%i*0.1682361183106]
*** TEST 27 FAILED ***